Target
Orexin/Hypocretin receptor type 1
Ligand
BDBM143787
Substrate
Meas. Tech.
Rat and Human Orexin 1 Receptor Radioligand Binding Studies
Ki
3.00±n/a nM
Citation
 Gelin, CFLebold, TPShireman, BTZiff, JM Substituted 2-azabicycles and their use as orexin receptor modulators US Patent  US10183953 Publication Date 1/22/2019 
Target
Name:
Orexin/Hypocretin receptor type 1
Synonyms:
Hcrtr1 OX1R_RAT Orexin receptor type 1 (OX1R) Ox1-R | Ox1R
Type:
Protein
Mol. Mass.:
46817.55
Organism:
Rattus norvegicus (Rat)
Description:
P56718
Residue:
416
  
Inhibitor
Name:
BDBM143787
Synonyms:
US10183953, Example 48 US9611277, Example 48 | US9845333, 48
Type:
Small organic molecule
Emp. Form.:
C22H18BrFN4O2
Mol. Mass.:
469.306
SMILES:
Fc1cccc(C(=O)N2CC3CC(Oc4ccc(Br)cn4)C2C3)c1-c1ncccn1
: