Target
Orexin/Hypocretin receptor type 1
Ligand
BDBM143771
Substrate
Meas. Tech.
Rat and Human Orexin 1 Receptor Radioligand Binding Studies
Ki
3.00±n/a nM
Citation
 Gelin, CFLebold, TPShireman, BTZiff, JM Substituted 2-azabicycles and their use as orexin receptor modulators US Patent  US10183953 Publication Date 1/22/2019 
Target
Name:
Orexin/Hypocretin receptor type 1
Synonyms:
Hcrtr1 OX1R_RAT Orexin receptor type 1 (OX1R) Ox1-R | Ox1R
Type:
Protein
Mol. Mass.:
46817.55
Organism:
Rattus norvegicus (Rat)
Description:
P56718
Residue:
416
  
Inhibitor
Name:
BDBM143771
Synonyms:
US10183953, Example 32 US9845333, 32
Type:
Small organic molecule
Emp. Form.:
C23H20F3N3O3
Mol. Mass.:
443.4184
SMILES:
Cc1cccc(C(=O)N2CC3CC(Oc4ccc(cn4)C(F)(F)F)C2C3)c1-c1ncco1
: