Target
Orexin/Hypocretin receptor type 1
Ligand
BDBM314974
Substrate
Meas. Tech.
Human Orexin 1 Receptor Ca2+ Mobilization Assay
Ki
3.00±n/a nM
Citation
 Gelin, CFLebold, TPShireman, BTZiff, JM Substituted 2-azabicycles and their use as orexin receptor modulators US Patent  US10183953 Publication Date 1/22/2019 
Target
Name:
Orexin/Hypocretin receptor type 1
Synonyms:
HCRTR1 OX1R_HUMAN Orexin receptor type 1 (OR 1) Orexin receptor type 1 (OX1) Orexin receptor type 1 (OxR1) | Ox1r
Type:
Protein
Mol. Mass.:
47554.50
Organism:
Homo sapiens (Human)
Description:
O43613
Residue:
425
  
Inhibitor
Name:
BDBM314974
Synonyms:
(2-(2H-1,2,3-triazol-2-yl)phenyl)((1S,4S,6R)-6-(methyl(5-(trifluoromethyl)pyridin-2-yl)amino)-2-azabicyclo[2.2.1]heptan-2-yl)methanone US9611277, Example 153
Type:
Small organic molecule
Emp. Form.:
C22H21F3N6O
Mol. Mass.:
442.4369
SMILES:
CN(C1CC2CC1N(C2)C(=O)c1ccccc1-n1nccn1)c1ccc(cn1)C(F)(F)F
: