Target
Toll-like receptor 7
Ligand
BDBM323079
Substrate
Meas. Tech.
HEK293-Blue-hTLR-7 Cells Assay
EC50
15000±n/a nM
Citation
 Liu, HWu, GYun, H Oxathiolane carboxylic acids and derivatives for the treatment and prophylaxis of virus infection US Patent  US10183954 Publication Date 1/22/2019 
Target
Name:
Toll-like receptor 7
Synonyms:
ORF Names:UNQ248/PRO285 TLR7_HUMAN | Toll-like receptor 7 (TLR7)
Type:
Enzyme
Mol. Mass.:
120945.35
Organism:
Homo sapiens (Human)
Description:
Q9NYK1
Residue:
1049
  
Inhibitor
Name:
BDBM323079
Synonyms:
US10183954, Example 13-P3
Type:
Small organic molecule
Emp. Form.:
C15H18N4O6S2
Mol. Mass.:
414.457
SMILES:
COC(=O)CC1SC(OC1n1c2nc(N)[nH]c(=O)c2sc1=O)[C@@H](O)C1CC1
: