Target
Sodium channel protein type 9 subunit alpha
Ligand
BDBM316481
Substrate
Meas. Tech.
Electrophysiological Assay
IC50
6.80±n/a nM
Citation
 Sun, SZenova, AYChafeev, MJia, QZhang, ZOballa, RM Benzenesulfonamide compounds and their use as therapeutic agents US Patent  US9630929 Publication Date 4/25/2017 
Target
Name:
Sodium channel protein type 9 subunit alpha
Synonyms:
NENA Peripheral sodium channel 1 SCN9A_HUMAN Voltage-gated sodium channel subunit Nav1.7 hNE-Na
Type:
Protein
Mol. Mass.:
226375.97
Organism:
Homo sapiens (Human)
Description:
Q15858
Residue:
1988
  
Inhibitor
Name:
BDBM316481
Synonyms:
2,5-difluoro-4-((trans-4-(4-fluorophenyl)piperidin-3-yl)methoxy)-N-(1,2,4-thiadiazol-5-yl)benzenesulfonamide | US9630929, Example 45
Type:
Small organic molecule
Emp. Form.:
C20H19F3N4O3S2
Mol. Mass.:
484.515
SMILES:
Fc1ccc(cc1)C1CCNC[C@H]1COc1cc(F)c(cc1F)S(=O)(=O)Nc1ncns1
: