Target
Sodium channel protein type 9 subunit alpha
Ligand
BDBM323081
Substrate
Meas. Tech.
Electrophysiological Assay
IC50
<100±n/a nM
Citation
 Sun, SZenova, AYChafeev, MJia, QZhang, ZOballa, RM Benzenesulfonamide compounds and their use as therapeutic agents US Patent  US9630929 Publication Date 4/25/2017 
Target
Name:
Sodium channel protein type 9 subunit alpha
Synonyms:
NENA Peripheral sodium channel 1 SCN9A_HUMAN Voltage-gated sodium channel subunit Nav1.7 hNE-Na
Type:
Protein
Mol. Mass.:
226375.97
Organism:
Homo sapiens (Human)
Description:
Q15858
Residue:
1988
  
Inhibitor
Name:
BDBM323081
Synonyms:
4-((trans-4-(4-chlorophenyl)piperidin-3-yl(methoxy)-2,5-difluoro-N-(1,3,4-thiadiazol-2-yl)benzenesulfonamide | US9630929, Example 51
Type:
Small organic molecule
Emp. Form.:
C20H19ClF2N4O3S2
Mol. Mass.:
500.97
SMILES:
Fc1cc(c(F)cc1OC[C@@H]1CNCCC1c1ccc(Cl)cc1)S(=O)(=O)Nc1nncs1
: