Target
Sodium channel protein type 9 subunit alpha
Ligand
BDBM323095
Substrate
Meas. Tech.
Electrophysiological Assay
IC50
280±n/a nM
Citation
 Sun, SZenova, AYChafeev, MJia, QZhang, ZOballa, RM Benzenesulfonamide compounds and their use as therapeutic agents US Patent  US9630929 Publication Date 4/25/2017 
Target
Name:
Sodium channel protein type 9 subunit alpha
Synonyms:
NENA Peripheral sodium channel 1 SCN9A_HUMAN Voltage-gated sodium channel subunit Nav1.7 hNE-Na
Type:
Protein
Mol. Mass.:
226375.97
Organism:
Homo sapiens (Human)
Description:
Q15858
Residue:
1988
  
Inhibitor
Name:
BDBM323095
Synonyms:
2,5-difluoro-4-((trans-2-(4-fluorophenyl)cyclohexyl)methoxy)-N-(1,2,4-thiadiazol-5-yl)benzenesulfonamide | US9630929, Example 68
Type:
Small organic molecule
Emp. Form.:
C21H20F3N3O3S2
Mol. Mass.:
483.527
SMILES:
Fc1ccc(cc1)C1CCCC[C@H]1COc1cc(F)c(cc1F)S(=O)(=O)Nc1ncns1
: