Target
Sodium channel protein type 9 subunit alpha
Ligand
BDBM50024246
Substrate
Meas. Tech.
Electrophysiological Assay
IC50
<100±n/a nM
Citation
 Sun, SZenova, AYChafeev, MJia, QZhang, ZOballa, RM Benzenesulfonamide compounds and their use as therapeutic agents US Patent  US9630929 Publication Date 4/25/2017 
Target
Name:
Sodium channel protein type 9 subunit alpha
Synonyms:
NENA Peripheral sodium channel 1 SCN9A_HUMAN Voltage-gated sodium channel subunit Nav1.7 hNE-Na
Type:
Protein
Mol. Mass.:
226375.97
Organism:
Homo sapiens (Human)
Description:
Q15858
Residue:
1988
  
Inhibitor
Name:
BDBM50024246
Synonyms:
CHEMBL3325526 | US9630929, Example 77
Type:
Small organic molecule
Emp. Form.:
C20H19ClF2N4O3S2
Mol. Mass.:
500.97
SMILES:
Fc1cc(c(F)cc1OC[C@H]1CNCC[C@@H]1c1ccc(Cl)cc1)S(=O)(=O)Nc1ncns1
: