Target
Sodium channel protein type 9 subunit alpha
Ligand
BDBM323125
Substrate
Meas. Tech.
Electrophysiological Assay
IC50
4490±n/a nM
Citation
 Sun, SZenova, AYChafeev, MJia, QZhang, ZOballa, RM Benzenesulfonamide compounds and their use as therapeutic agents US Patent  US9630929 Publication Date 4/25/2017 
Target
Name:
Sodium channel protein type 9 subunit alpha
Synonyms:
NENA Peripheral sodium channel 1 SCN9A_HUMAN Voltage-gated sodium channel subunit Nav1.7 hNE-Na
Type:
Protein
Mol. Mass.:
226375.97
Organism:
Homo sapiens (Human)
Description:
Q15858
Residue:
1988
  
Inhibitor
Name:
BDBM323125
Synonyms:
2,5-difluoro-4-((trans-6-oxo-4-(2,4,5-trifluorophenyl)piperidin-3-yl)methoxy)-N-(1,2,4-thiadiazol-5-yl(benzenesulfonamide | US9630929, Example 101
Type:
Small organic molecule
Emp. Form.:
C20H15F5N4O4S2
Mol. Mass.:
534.48
SMILES:
Fc1cc(F)c(cc1F)C1CC(=O)NC[C@H]1COc1cc(F)c(cc1F)S(=O)(=O)Nc1ncns1
: