Target
Serine/threonine-protein kinase Chk1
Ligand
BDBM323148
Substrate
Meas. Tech.
Kinase Inhibition Asssay
IC50
0.280±n/a nM
Citation
 Boyle, RGBoyce, RJ Pharmaceutically active pyrazine derivatives US Patent  US9630931 Publication Date 4/25/2017 
Target
Name:
Serine/threonine-protein kinase Chk1
Synonyms:
CHEK1 CHK1 checkpoint homolog Checkpoint kinase-1 (CHK1)
Type:
Enzyme Catalytic Domain
Mol. Mass.:
54443.02
Organism:
Homo sapiens (Human)
Description:
gi_166295192
Residue:
476
  
Inhibitor
Name:
BDBM323148
Synonyms:
US9630931, Example 11
Type:
Small organic molecule
Emp. Form.:
C23H30ClN7O4S
Mol. Mass.:
536.047
SMILES:
COc1cc(CCN[C@@H](C)C2CCN(CC2)S(C)(=O)=O)c(Cl)cc1NC(=O)Nc1cnc(cn1)C#N
: