Target
Nuclear receptor ROR-gamma
Ligand
BDBM189904
Substrate
Meas. Tech.
Assay of Co-Activator Recruitment by TR-FRET
pH
7.5±n/a
Temperature
298.15±n/a K
IC50
0.90±n/a nM
Comments
extracted
Citation
 Wennerstål, GMZamaratski, E Methyl- and trifluoromethyl-substituted pyrrolopyridine modulators of RORC2 and methods of use thereof US Patent  US9670201 Publication Date 6/6/2017 
Target
Name:
Nuclear receptor ROR-gamma
Synonyms:
NR1F3 Nuclear receptor ROR-gamma (RORC) RAR-related orphan receptor C (RORc) RORG RZRG Retinoid-related orphan receptor-gamma (RORc)
Type:
Enzyme Catalytic Domain
Mol. Mass.:
58218.40
Organism:
Homo sapiens (Human)
Description:
P51449
Residue:
518
  
Inhibitor
Name:
BDBM189904
Synonyms:
US10227346, Example 29 US9670201, 29 (S)-3-cyano-N-(1-methyl-3-(1-(tetrahydrothiophene-2-carbonyl)piperidin-4-yl)-4-(trifluoromethyl)-1H-pyrrolo[2,3-b]pyridin-5-yl)benzamide | US9920054, Example 29
Type:
Small organic molecule
Emp. Form.:
C27H26F3N5O2S
Mol. Mass.:
541.588
SMILES:
Cn1cc(C2CCN(CC2)C(=O)[C@@H]2CCCS2)c2c(c(NC(=O)c3cccc(c3)C#N)cnc12)C(F)(F)F
: