Target
Nuclear receptor ROR-gamma
Ligand
BDBM190336
Substrate
Meas. Tech.
Assay of Co-Activator Recruitment by TR-FRET
pH
7.5±n/a
Temperature
298.15±n/a K
IC50
26±n/a nM
Comments
extracted
Citation
 Wennerstål, GMZamaratski, E Methyl- and trifluoromethyl-substituted pyrrolopyridine modulators of RORC2 and methods of use thereof US Patent  US9670201 Publication Date 6/6/2017 
Target
Name:
Nuclear receptor ROR-gamma
Synonyms:
NR1F3 Nuclear receptor ROR-gamma (RORC) RAR-related orphan receptor C (RORc) RORG RZRG Retinoid-related orphan receptor-gamma (RORc)
Type:
Enzyme Catalytic Domain
Mol. Mass.:
58218.40
Organism:
Homo sapiens (Human)
Description:
P51449
Residue:
518
  
Inhibitor
Name:
BDBM190336
Synonyms:
US10227346, Example 88 US9670201, 88 3-cyano-N-(1,4-dimethyl-3-((3R,4R)-3-methyl-1-((R)-3,3,3-trifluoro-2-methylpropanoyl)piperidin-4-yl)-1H-pyrrolo[2,3-b]pyridin-5-yl)benzamide | US9920054, Example 88
Type:
Small organic molecule
Emp. Form.:
C27H28F3N5O2
Mol. Mass.:
511.5387
SMILES:
C[C@H](C(=O)N1CC[C@H]([C@@H](C)C1)c1cn(C)c2ncc(NC(=O)c3cccc(c3)C#N)c(C)c12)C(F)(F)F
: