Target
Ataxin-2
Ligand
BDBM241094
Substrate
Meas. Tech.
Inhibition Assay
IC50
313±n/a nM
Citation
 Furminger, VHughes, ORLe Grand, DMStanley, EThomson, C Autotaxin inhibitors US Patent  US9630945 Publication Date 4/25/2017 
Target
Name:
Ataxin-2
Synonyms:
ATX2 ATXN2 Spinocerebellar ataxia type 2 protein Trinucleotide repeat-containing gene 13 protein
Type:
Mol. Mass.:
140337.65
Organism:
Homo sapiens (Human)
Description:
Q99700
Residue:
1313
  
Inhibitor
Name:
BDBM241094
Synonyms:
US9409895, 5 | US9630945, 5
Type:
Small organic molecule
Emp. Form.:
C21H25Cl2N3O5
Mol. Mass.:
470.346
SMILES:
CC1CC(CNC(=O)CCc2cc(O)no2)CCN1C(=O)OCc1cc(Cl)cc(Cl)c1
: