Target
Ataxin-2
Ligand
BDBM241102
Substrate
Meas. Tech.
Inhibition Assay
IC50
828±n/a nM
Citation
 Furminger, VHughes, ORLe Grand, DMStanley, EThomson, C Autotaxin inhibitors US Patent  US9630945 Publication Date 4/25/2017 
Target
Name:
Ataxin-2
Synonyms:
ATX2 ATXN2 Spinocerebellar ataxia type 2 protein Trinucleotide repeat-containing gene 13 protein
Type:
Mol. Mass.:
140337.65
Organism:
Homo sapiens (Human)
Description:
Q99700
Residue:
1313
  
Inhibitor
Name:
BDBM241102
Synonyms:
US9409895, 13 | US9630945, 13
Type:
Small organic molecule
Emp. Form.:
C19H21Cl2N3O6
Mol. Mass.:
458.293
SMILES:
CN(CCC1CN(CCO1)C(=O)OCc1cc(Cl)cc(Cl)c1)C(=O)c1c[nH]c(=O)o1
: