Target
Ataxin-2
Ligand
BDBM241109
Substrate
Meas. Tech.
Inhibition Assay
IC50
4.00±n/a nM
Citation
 Furminger, VHughes, ORLe Grand, DMStanley, EThomson, C Autotaxin inhibitors US Patent  US9630945 Publication Date 4/25/2017 
Target
Name:
Ataxin-2
Synonyms:
ATX2 ATXN2 Spinocerebellar ataxia type 2 protein Trinucleotide repeat-containing gene 13 protein
Type:
Mol. Mass.:
140337.65
Organism:
Homo sapiens (Human)
Description:
Q99700
Residue:
1313
  
Inhibitor
Name:
BDBM241109
Synonyms:
US9409895, 20 | US9630945, 20
Type:
Small organic molecule
Emp. Form.:
C20H25Cl2N5O3
Mol. Mass.:
454.35
SMILES:
Clc1cc(Cl)cc(COC(=O)N2CCC(CC2)NC(=O)CCCCc2c[nH]nn2)c1
: