Target
Melanocyte-stimulating hormone receptor
Ligand
BDBM323191
Substrate
Meas. Tech.
Transactivation Assay
EC50
120±n/a nM
Citation
 Bouix-Peter, CSuzuki, IRodeville, NMauvais, PPascal, J Oxoazetidine derivatives, process for the preparation thereof and use thereof in human medicine and in cosmetics US Patent  US9630949 Publication Date 4/25/2017 
Target
Name:
Melanocyte-stimulating hormone receptor
Synonyms:
MC1-R MSH-R MSHR_HUMAN Melanocortin receptor (M1 and M4) Melanocortin receptor 1 (MC1-R) | Melanocortin receptor 1 (MC1R)
Type:
Enzyme
Mol. Mass.:
34717.23
Organism:
Homo sapiens (Human)
Description:
Q01726
Residue:
317
  
Inhibitor
Name:
BDBM323191
Synonyms:
N-[(R)-2-(3-cyclopropylmethoxy-3-o-tolylazetidin-1-yl)-1-(4-methoxybenzyl)-2-oxoethyl]-3-(1H-imidazol-4-yl)propionamide | US9630949, 20
Type:
Small organic molecule
Emp. Form.:
C30H36N4O4
Mol. Mass.:
516.6312
SMILES:
COc1ccc(C[C@@H](NC(=O)CCc2c[nH]cn2)C(=O)N2CC(C2)(OCC2CC2)c2ccccc2C)cc1
: