Target
Melanocortin receptor 4
Ligand
BDBM323206
Substrate
Meas. Tech.
Transactivation Assay
EC50
3000±n/a nM
Citation
 Bouix-Peter, CSuzuki, IRodeville, NMauvais, PPascal, J Oxoazetidine derivatives, process for the preparation thereof and use thereof in human medicine and in cosmetics US Patent  US9630949 Publication Date 4/25/2017 
Target
Name:
Melanocortin receptor 4
Synonyms:
MC4-R MC4R_HUMAN Melanocortin receptor 4 (MC-4) Melanocortin receptor 4 (MC4R)
Type:
Enzyme
Mol. Mass.:
36949.50
Organism:
Homo sapiens (Human)
Description:
P32245
Residue:
332
  
Inhibitor
Name:
BDBM323206
Synonyms:
N-[(R)-2-(3-butoxy-3-phenylazetidin-1-yl)-1-(4-methoxybenzyl)-2-oxoethyl]-3-(1H-imidazol-4-yl)propionamide | US9630949, 36
Type:
Small organic molecule
Emp. Form.:
C29H36N4O4
Mol. Mass.:
504.6205
SMILES:
CCCCOC1(CN(C1)C(=O)[C@@H](Cc1ccc(OC)cc1)NC(=O)CCc1c[nH]cn1)c1ccccc1
: