Target
Melanocortin receptor 4
Ligand
BDBM323218
Substrate
Meas. Tech.
Transactivation Assay
EC50
500±n/a nM
Citation
 Bouix-Peter, CSuzuki, IRodeville, NMauvais, PPascal, J Oxoazetidine derivatives, process for the preparation thereof and use thereof in human medicine and in cosmetics US Patent  US9630949 Publication Date 4/25/2017 
Target
Name:
Melanocortin receptor 4
Synonyms:
MC4-R MC4R_HUMAN Melanocortin receptor 4 (MC-4) Melanocortin receptor 4 (MC4R)
Type:
Enzyme
Mol. Mass.:
36949.50
Organism:
Homo sapiens (Human)
Description:
P32245
Residue:
332
  
Inhibitor
Name:
BDBM323218
Synonyms:
N-[(R)-2-(3-butoxy-3-o-tolylazetidin-1-yl)-1-(4-methoxybenzyl)-2-oxoethyl]-3-(1H-imidazol-4-yl)acrylamide | US9630949, 48
Type:
Small organic molecule
Emp. Form.:
C30H36N4O4
Mol. Mass.:
516.6312
SMILES:
CCCCOC1(CN(C1)C(=O)[C@@H](Cc1ccc(OC)cc1)NC(=O)C=Cc1c[nH]cn1)c1ccccc1C
: