Target
Melanocyte-stimulating hormone receptor
Ligand
BDBM323225
Substrate
Meas. Tech.
Transactivation Assay
EC50
120±n/a nM
Citation
 Bouix-Peter, CSuzuki, IRodeville, NMauvais, PPascal, J Oxoazetidine derivatives, process for the preparation thereof and use thereof in human medicine and in cosmetics US Patent  US9630949 Publication Date 4/25/2017 
Target
Name:
Melanocyte-stimulating hormone receptor
Synonyms:
MC1-R MSH-R MSHR_HUMAN Melanocortin receptor (M1 and M4) Melanocortin receptor 1 (MC1-R) | Melanocortin receptor 1 (MC1R)
Type:
Enzyme
Mol. Mass.:
34717.23
Organism:
Homo sapiens (Human)
Description:
Q01726
Residue:
317
  
Inhibitor
Name:
BDBM323225
Synonyms:
N-[(R)-2-[3-(3-fluorophenyl)-3-pentylazetidin-1-yl]-1-(4-methoxybenzyl)-2-oxoethyl]-3-(1H-imidazol-4-yl)propionamide | US9630949, 55
Type:
Small organic molecule
Emp. Form.:
C28H33FN4O3
Mol. Mass.:
492.585
SMILES:
CCCC1(CN(C1)C(=O)[C@@H](Cc1ccc(OC)cc1)NC(=O)CCc1c[nH]cn1)c1cccc(F)c1
: