Target
Melanocortin receptor 4
Ligand
BDBM323239
Substrate
Meas. Tech.
Transactivation Assay
EC50
2000±n/a nM
Citation
 Bouix-Peter, CSuzuki, IRodeville, NMauvais, PPascal, J Oxoazetidine derivatives, process for the preparation thereof and use thereof in human medicine and in cosmetics US Patent  US9630949 Publication Date 4/25/2017 
Target
Name:
Melanocortin receptor 4
Synonyms:
MC4-R MC4R_HUMAN Melanocortin receptor 4 (MC-4) Melanocortin receptor 4 (MC4R)
Type:
Enzyme
Mol. Mass.:
36949.50
Organism:
Homo sapiens (Human)
Description:
P32245
Residue:
332
  
Inhibitor
Name:
BDBM323239
Synonyms:
N-[(R)-2-[3-Butoxy-3-(2-fluorophenyl)azetidin-1-yl]-1-(4-methoxybenzyl)-2-oxoethyl]-3-(1H-imidazol-4-yl)propionamide | US9630949, 68
Type:
Small organic molecule
Emp. Form.:
C29H35FN4O4
Mol. Mass.:
522.611
SMILES:
CCCCOC1(CN(C1)C(=O)[C@@H](Cc1ccc(OC)cc1)NC(=O)CCc1c[nH]cn1)c1ccccc1F
: