Target
Melanocyte-stimulating hormone receptor
Ligand
BDBM323241
Substrate
Meas. Tech.
Transactivation Assay
EC50
4000±n/a nM
Citation
 Bouix-Peter, CSuzuki, IRodeville, NMauvais, PPascal, J Oxoazetidine derivatives, process for the preparation thereof and use thereof in human medicine and in cosmetics US Patent  US9630949 Publication Date 4/25/2017 
Target
Name:
Melanocyte-stimulating hormone receptor
Synonyms:
MC1-R MSH-R MSHR_HUMAN Melanocortin receptor (M1 and M4) Melanocortin receptor 1 (MC1-R) | Melanocortin receptor 1 (MC1R)
Type:
Enzyme
Mol. Mass.:
34717.23
Organism:
Homo sapiens (Human)
Description:
Q01726
Residue:
317
  
Inhibitor
Name:
BDBM323241
Synonyms:
N-[2-(3-Butoxy-3-o-tolylazetidin-1-yl)-1-(2-hydroxy-4-methoxybenzyl)-2-oxoethyl]-3-(3H-imidazol-4-yl)propionamide | US9630949, 70
Type:
Small organic molecule
Emp. Form.:
C30H38N4O5
Mol. Mass.:
534.6465
SMILES:
CCCCOC1(CN(C1)C(=O)C(Cc1ccc(OC)cc1O)NC(=O)CCc1cnc[nH]1)c1ccccc1C
: