Target
Melanocyte-stimulating hormone receptor
Ligand
BDBM323254
Substrate
Meas. Tech.
Transactivation Assay
EC50
2000±n/a nM
Citation
 Bouix-Peter, CSuzuki, IRodeville, NMauvais, PPascal, J Oxoazetidine derivatives, process for the preparation thereof and use thereof in human medicine and in cosmetics US Patent  US9630949 Publication Date 4/25/2017 
Target
Name:
Melanocyte-stimulating hormone receptor
Synonyms:
MC1-R MSH-R MSHR_HUMAN Melanocortin receptor (M1 and M4) Melanocortin receptor 1 (MC1-R) | Melanocortin receptor 1 (MC1R)
Type:
Enzyme
Mol. Mass.:
34717.23
Organism:
Homo sapiens (Human)
Description:
Q01726
Residue:
317
  
Inhibitor
Name:
BDBM323254
Synonyms:
N-[(R)-2-(3-Butoxy-3-o-tolylazetidin-1-yl)-1-(4-hydroxybenzyl)-2-oxoethyl]-3-(3H-imidazol-4-yl)propionamide | US9630949, 72
Type:
Small organic molecule
Emp. Form.:
C29H36N4O4
Mol. Mass.:
504.6205
SMILES:
CCCCOC1(CN(C1)C(=O)[C@@H](Cc1ccc(O)cc1)NC(=O)CCc1cnc[nH]1)c1ccccc1C
: