Target
Retinoid isomerohydrolase
Ligand
BDBM323425
Substrate
Meas. Tech.
In Vitro Isomerase Inhibition Assay
IC50
<100.0±n/a nM
Citation
 Scott, ILKuksa, VAOrme, MWLittle, Jr., TLGall, AHong, F Alkoxy compounds for disease treatment US Patent  US10188615 Publication Date 1/29/2019 
Target
Name:
Retinoid isomerohydrolase
Synonyms:
Lutein isomerase RPE65 Retinal pigment epithelium-specific 65 kDa protein | Retinoid isomerohydrolase
Type:
Enzyme Catalytic Domain
Mol. Mass.:
60946.29
Organism:
Homo sapiens (Human)
Description:
Q16518
Residue:
533
  
Inhibitor
Name:
BDBM323425
Synonyms:
(1R,2R)-3-Amino-2-Methyl-1-(3-(2-Propylpentyloxy)Phenyl)Propan-1-Ol US10639286, Example 55
Type:
Small organic molecule
Emp. Form.:
C18H31NO2
Mol. Mass.:
293.4442
SMILES:
CCCC(CCC)COc1cccc(c1)[C@H](O)[C@H](C)CN
: