Target
Retinoid isomerohydrolase
Ligand
BDBM323474
Substrate
Meas. Tech.
In Vitro Isomerase Inhibition Assay
IC50
55.0±n/a nM
Citation
 Scott, ILKuksa, VAOrme, MWLittle, Jr., TLGall, AHong, F Alkoxy compounds for disease treatment US Patent  US10188615 Publication Date 1/29/2019 
Target
Name:
Retinoid isomerohydrolase
Synonyms:
Lutein isomerase RPE65 Retinal pigment epithelium-specific 65 kDa protein | Retinoid isomerohydrolase
Type:
Enzyme Catalytic Domain
Mol. Mass.:
60946.29
Organism:
Homo sapiens (Human)
Description:
Q16518
Residue:
533
  
Inhibitor
Name:
BDBM323474
Synonyms:
3-Amino-1-(3-(Cyclooctylmethoxy)Phenyl)Propan-1-Ol US10639286, Example 106
Type:
Small organic molecule
Emp. Form.:
C18H29NO2
Mol. Mass.:
291.4284
SMILES:
NCCC(O)c1cccc(OCC2CCCCCCC2)c1
: