Target
Retinoid isomerohydrolase
Ligand
BDBM323487
Substrate
Meas. Tech.
In Vitro Isomerase Inhibition Assay
IC50
55.0±n/a nM
Citation
 Scott, ILKuksa, VAOrme, MWLittle, Jr., TLGall, AHong, F Alkoxy compounds for disease treatment US Patent  US10188615 Publication Date 1/29/2019 
Target
Name:
Retinoid isomerohydrolase
Synonyms:
Lutein isomerase RPE65 Retinal pigment epithelium-specific 65 kDa protein | Retinoid isomerohydrolase
Type:
Enzyme Catalytic Domain
Mol. Mass.:
60946.29
Organism:
Homo sapiens (Human)
Description:
Q16518
Residue:
533
  
Inhibitor
Name:
BDBM323487
Synonyms:
1-(3-(3-Amino-1-Hydroxypropyl)Phenoxy)Pentan-2-Ol US10639286, Example 163
Type:
Small organic molecule
Emp. Form.:
C14H23NO3
Mol. Mass.:
253.3373
SMILES:
CCCC(O)COc1cccc(c1)C(O)CCN
: