Target
Retinoid isomerohydrolase
Ligand
BDBM323502
Substrate
Meas. Tech.
In Vitro Isomerase Inhibition Assay
IC50
550±n/a nM
Citation
 Scott, ILKuksa, VAOrme, MWLittle, Jr., TLGall, AHong, F Alkoxy compounds for disease treatment US Patent  US10188615 Publication Date 1/29/2019 
Target
Name:
Retinoid isomerohydrolase
Synonyms:
Lutein isomerase RPE65 Retinal pigment epithelium-specific 65 kDa protein | Retinoid isomerohydrolase
Type:
Enzyme Catalytic Domain
Mol. Mass.:
60946.29
Organism:
Homo sapiens (Human)
Description:
Q16518
Residue:
533
  
Inhibitor
Name:
BDBM323502
Synonyms:
1-((3-(2-Aminoethoxy)Phenoxy)Methyl)Cyclohexanol US10639286, Example 26
Type:
Small organic molecule
Emp. Form.:
C15H23NO3
Mol. Mass.:
265.348
SMILES:
NCCOc1cccc(OCC2(O)CCCCC2)c1
: