Target
Retinoid isomerohydrolase
Ligand
BDBM323529
Substrate
Meas. Tech.
In Vitro Isomerase Inhibition Assay
IC50
550±n/a nM
Citation
 Scott, ILKuksa, VAOrme, MWLittle, Jr., TLGall, AHong, F Alkoxy compounds for disease treatment US Patent  US10188615 Publication Date 1/29/2019 
Target
Name:
Retinoid isomerohydrolase
Synonyms:
Lutein isomerase RPE65 Retinal pigment epithelium-specific 65 kDa protein | Retinoid isomerohydrolase
Type:
Enzyme Catalytic Domain
Mol. Mass.:
60946.29
Organism:
Homo sapiens (Human)
Description:
Q16518
Residue:
533
  
Inhibitor
Name:
BDBM323529
Synonyms:
3-(3-(2,6-Dichlorobenzyloxy)Phenyl)Propan-1-Amine US10639286, Example 91
Type:
Small organic molecule
Emp. Form.:
C16H17Cl2NO
Mol. Mass.:
310.218
SMILES:
NCCCc1cccc(OCc2c(Cl)cccc2Cl)c1
: