Target
Retinoid isomerohydrolase
Ligand
BDBM323539
Substrate
Meas. Tech.
In Vitro Isomerase Inhibition Assay
IC50
550±n/a nM
Citation
 Scott, ILKuksa, VAOrme, MWLittle, Jr., TLGall, AHong, F Alkoxy compounds for disease treatment US Patent  US10188615 Publication Date 1/29/2019 
Target
Name:
Retinoid isomerohydrolase
Synonyms:
Lutein isomerase RPE65 Retinal pigment epithelium-specific 65 kDa protein | Retinoid isomerohydrolase
Type:
Enzyme Catalytic Domain
Mol. Mass.:
60946.29
Organism:
Homo sapiens (Human)
Description:
Q16518
Residue:
533
  
Inhibitor
Name:
BDBM323539
Synonyms:
2-Amino-1-(3-(Cyclohexylmethoxy)Phenyl)Ethanol US10639286, Example 127
Type:
Small organic molecule
Emp. Form.:
C15H23NO2
Mol. Mass.:
249.3486
SMILES:
NCC(O)c1cccc(OCC2CCCCC2)c1
: