Target
Retinoid isomerohydrolase
Ligand
BDBM323564
Substrate
Meas. Tech.
In Vitro Isomerase Inhibition Assay
IC50
5500±n/a nM
Citation
 Scott, ILKuksa, VAOrme, MWLittle, Jr., TLGall, AHong, F Alkoxy compounds for disease treatment US Patent  US10188615 Publication Date 1/29/2019 
Target
Name:
Retinoid isomerohydrolase
Synonyms:
Lutein isomerase RPE65 Retinal pigment epithelium-specific 65 kDa protein | Retinoid isomerohydrolase
Type:
Enzyme Catalytic Domain
Mol. Mass.:
60946.29
Organism:
Homo sapiens (Human)
Description:
Q16518
Residue:
533
  
Inhibitor
Name:
BDBM323564
Synonyms:
3-(3-(2-Aminoethoxy)Phenoxy)Propan-1-Ol US10639286, Example 95
Type:
Small organic molecule
Emp. Form.:
C11H17NO3
Mol. Mass.:
211.2576
SMILES:
NCCOc1cccc(OCCCO)c1
: