Target
Retinoid isomerohydrolase
Ligand
BDBM323569
Substrate
Meas. Tech.
In Vitro Isomerase Inhibition Assay
IC50
5500±n/a nM
Citation
 Scott, ILKuksa, VAOrme, MWLittle, Jr., TLGall, AHong, F Alkoxy compounds for disease treatment US Patent  US10188615 Publication Date 1/29/2019 
Target
Name:
Retinoid isomerohydrolase
Synonyms:
Lutein isomerase RPE65 Retinal pigment epithelium-specific 65 kDa protein | Retinoid isomerohydrolase
Type:
Enzyme Catalytic Domain
Mol. Mass.:
60946.29
Organism:
Homo sapiens (Human)
Description:
Q16518
Residue:
533
  
Inhibitor
Name:
BDBM323569
Synonyms:
N1-(3-(Cyclohexylmethoxy)Phenyl)-N1-Methylethane-1,2-Diamine US10639286, Example 128
Type:
Small organic molecule
Emp. Form.:
C16H26N2O
Mol. Mass.:
262.3904
SMILES:
CN(CCN)c1cccc(OCC2CCCCC2)c1
: