Target
Retinoic acid receptor RXR-alpha
Ligand
BDBM323588
Substrate
Meas. Tech.
Retinoid Nuclear Receptor Activity
EC50
316±n/a nM
Citation
 Scott, ILKuksa, VAOrme, MWLittle, Jr., TLGall, AHong, F Alkoxy compounds for disease treatment US Patent  US10188615 Publication Date 1/29/2019 
Target
Name:
Retinoic acid receptor RXR-alpha
Synonyms:
NR2B1 Nuclear receptor subfamily 4 group A member 2 RXRA Retinoic acid receptor RXR-alpha/gamma Retinoid receptor
Type:
PROTEIN
Mol. Mass.:
50820.38
Organism:
Homo sapiens (Human)
Description:
ChEMBL_1456363
Residue:
462
  
Inhibitor
Name:
BDBM323588
Synonyms:
Retinoic Acid US10752616, Code No. atRA at-RA
Type:
Small organic molecule
Emp. Form.:
C20H28O2
Mol. Mass.:
300.4351
SMILES:
CC(C=CC1=C(C)CCCC1(C)C)=CC=CC(C)=CC(O)=O
: