Target
Peroxisome proliferator-activated receptor delta
Ligand
BDBM50192829
Substrate
Meas. Tech.
Nuclear Hormone Receptor (NHR) Assay
EC50
56.0±n/a nM
Citation
 Downes, MEvans, RKluge, ALagu, BMiura, MPanigrahi, SKPatane, MSamajdar, SSenaiar, RTakahashi, T PPAR agonists, compounds, pharmaceutical compositions, and methods of use thereof US Patent  US10188627 Publication Date 1/29/2019 
Target
Name:
Peroxisome proliferator-activated receptor delta
Synonyms:
NR1C2 NUCI Nuclear receptor subfamily 1 group C member 2 PPAR-beta PPARD Peroxisome proliferator-activated receptor Peroxisome proliferator-activated receptor delta
Type:
Enzyme
Mol. Mass.:
49910.45
Organism:
Homo sapiens (Human)
Description:
Q03181
Residue:
441
  
Inhibitor
Name:
BDBM50192829
Synonyms:
CHEMBL3958704 | US10188627, Compound 8a
Type:
Small organic molecule
Emp. Form.:
C26H27NO5
Mol. Mass.:
433.4963
SMILES:
CN(Cc1ccccc1OC\C=C(/C)CCC(O)=O)C(=O)c1ccc(cc1)-c1ccco1
: