Target
Peroxisome proliferator-activated receptor delta
Ligand
BDBM323603
Substrate
Meas. Tech.
Nuclear Hormone Receptor (NHR) Assay
EC50
1639±n/a nM
Citation
 Downes, MEvans, RKluge, ALagu, BMiura, MPanigrahi, SKPatane, MSamajdar, SSenaiar, RTakahashi, T PPAR agonists, compounds, pharmaceutical compositions, and methods of use thereof US Patent  US10188627 Publication Date 1/29/2019 
Target
Name:
Peroxisome proliferator-activated receptor delta
Synonyms:
NR1C2 NUCI Nuclear receptor subfamily 1 group C member 2 PPAR-beta PPARD Peroxisome proliferator-activated receptor Peroxisome proliferator-activated receptor delta
Type:
Enzyme
Mol. Mass.:
49910.45
Organism:
Homo sapiens (Human)
Description:
Q03181
Residue:
441
  
Inhibitor
Name:
BDBM323603
Synonyms:
6-(2-((4-(furan-2-yl)-N-methylbenzamido)methyl)phenoxy)-2-methylhexanoic acid | US10188627, Compound 8o
Type:
Small organic molecule
Emp. Form.:
C26H29NO5
Mol. Mass.:
435.5122
SMILES:
CC(CCCCOc1ccccc1CN(C)C(=O)c1ccc(cc1)-c1ccco1)C(O)=O
: