Target
PPAR delta protein
Ligand
BDBM50192832
Substrate
Meas. Tech.
Luciferase Assay
EC50
1.93±n/a nM
Citation
 Downes, MEvans, RKluge, ALagu, BMiura, MPanigrahi, SKPatane, MSamajdar, SSenaiar, RTakahashi, T PPAR agonists, compounds, pharmaceutical compositions, and methods of use thereof US Patent  US10188627 Publication Date 1/29/2019 
Target
Name:
PPAR delta protein
Synonyms:
PPAR delta
Type:
Mol. Mass.:
49664.60
Organism:
Rattus norvegicus (Rat)
Description:
Q62879
Residue:
440
  
Inhibitor
Name:
BDBM50192832
Synonyms:
CHEMBL3975891 | US10188627, Compound 8c
Type:
Small organic molecule
Emp. Form.:
C26H26FNO5
Mol. Mass.:
451.4867
SMILES:
CN(Cc1ccccc1OC\C=C(/C)CCC(O)=O)C(=O)c1ccc(-c2ccco2)c(F)c1
: