Target
Dual specificity protein kinase TTK
Ligand
BDBM230883
Substrate
Meas. Tech.
Measurement of Inhibition of MPS1 Kinase
IC50
4.00±n/a nM
Citation
 Hoelder, SBlagg, JCheung, KJAtrash, BSheldrake, P Pharmacologically active compounds US Patent  US10188642 Publication Date 1/29/2019 
Target
Name:
Dual specificity protein kinase TTK
Synonyms:
Dual specificity protein kinase (TTK) MPS1 Monopolar Spindle 1 (MPS1) Monopolar Spindle 1 Kinase (MPS1) TTK | TTK_HUMAN
Type:
Protein
Mol. Mass.:
97086.79
Organism:
Homo sapiens (Human)
Description:
P33981
Residue:
857
  
Inhibitor
Name:
BDBM230883
Synonyms:
US10188642, Example 9 | US9334286, 9
Type:
Small organic molecule
Emp. Form.:
C24H21N5OS
Mol. Mass.:
427.521
SMILES:
COc1cc(ccc1Nc1cc2cc(ccc2cn1)-c1cncs1)-c1cnc(C)n1C
: