Target
Dual specificity protein kinase TTK
Ligand
BDBM230970
Substrate
Meas. Tech.
Measurement of Inhibition of MPS1 Kinase
IC50
2.00±n/a nM
Citation
 Hoelder, SBlagg, JCheung, KJAtrash, BSheldrake, P Pharmacologically active compounds US Patent  US10188642 Publication Date 1/29/2019 
Target
Name:
Dual specificity protein kinase TTK
Synonyms:
Dual specificity protein kinase (TTK) MPS1 Monopolar Spindle 1 (MPS1) Monopolar Spindle 1 Kinase (MPS1) TTK | TTK_HUMAN
Type:
Protein
Mol. Mass.:
97086.79
Organism:
Homo sapiens (Human)
Description:
P33981
Residue:
857
  
Inhibitor
Name:
BDBM230970
Synonyms:
US10188642, Example 96 | US9334286, 96
Type:
Small organic molecule
Emp. Form.:
C27H30N6O4
Mol. Mass.:
502.5649
SMILES:
COC1CN(C1)C(=O)c1ccc(Nc2cc3cc(ccc3cn2)-c2cn(CC(C)(C)O)nn2)c(OC)c1
: