Target
Diacylglycerol O-acyltransferase 2
Ligand
BDBM323623
Substrate
Meas. Tech.
In Vitro DGAT2 Assay
IC50
62.3±n/a nM
Citation
 Futatsugi, K Diacylglycerol acyltransferase 2 inhibitors US Patent  US10188653 Publication Date 1/29/2019 
Target
Name:
Diacylglycerol O-acyltransferase 2
Synonyms:
ARAT DGAT2 Diacylglycerol O-acyltransferase 2 (DGAT2) Retinol O-fatty-acyltransferase
Type:
Multi-pass membrane protein
Mol. Mass.:
43848.90
Organism:
Homo sapiens (Human)
Description:
Q96PD7
Residue:
388
  
Inhibitor
Name:
BDBM323623
Synonyms:
US10188653, Example 12 | US9789110, 12
Type:
Small organic molecule
Emp. Form.:
C26H29N5O5
Mol. Mass.:
491.539
SMILES:
CCOc1ccccc1O[C@@H]1CCCN(C1)c1ncc(cn1)C(=O)NCc1cc(cnc1C)C(O)=O
: