Target
Diacylglycerol O-acyltransferase 2
Ligand
BDBM323628
Substrate
Meas. Tech.
In Vitro DGAT2 Assay
IC50
182±n/a nM
Citation
 Futatsugi, K Diacylglycerol acyltransferase 2 inhibitors US Patent  US10188653 Publication Date 1/29/2019 
Target
Name:
Diacylglycerol O-acyltransferase 2
Synonyms:
ARAT DGAT2 Diacylglycerol O-acyltransferase 2 (DGAT2) Retinol O-fatty-acyltransferase
Type:
Multi-pass membrane protein
Mol. Mass.:
43848.90
Organism:
Homo sapiens (Human)
Description:
Q96PD7
Residue:
388
  
Inhibitor
Name:
BDBM323628
Synonyms:
US10188653, Example 17 | US9789110, 17
Type:
Small organic molecule
Emp. Form.:
C21H25N5O3
Mol. Mass.:
395.4549
SMILES:
CCNC(=O)c1cnc(nc1)N1CCC[C@H](C1)Oc1ccc(cc1OCC)C#N
: