Target
Histone deacetylase 3
Ligand
BDBM19149
Substrate
Meas. Tech.
HDAC Inhibition Assay
IC50
3.00±n/a nM
Citation
 Hooker, JMWang, CSchroeder, FA Imaging histone deacetylases with a radiotracer using positron emission tomography US Patent  US10188756 Publication Date 1/29/2019 
Target
Name:
Histone deacetylase 3
Synonyms:
HD3 HDAC3_HUMAN Human HDAC3 SMAP45
Type:
Enzyme
Mol. Mass.:
48829.55
Organism:
Homo sapiens (Human)
Description:
O15379
Residue:
428
  
Inhibitor
Name:
BDBM19149
Synonyms:
CHEMBL98 SAHA US10188756, Compound SAHA US11505523, Compound SAHA US9353061, SAHA US9695181, Vorinostat Zolinza suberoylanilide hydroxamic acid
Type:
Small organic molecule
Emp. Form.:
C14H20N2O3
Mol. Mass.:
264.3202
SMILES:
ONC(=O)CCCCCCC(=O)Nc1ccccc1
: