Target
Histone deacetylase 2
Ligand
BDBM50353238
Substrate
Meas. Tech.
HDAC Inhibition Assay
IC50
18.0±n/a nM
Citation
 Hooker, JMWang, CSchroeder, FA Imaging histone deacetylases with a radiotracer using positron emission tomography US Patent  US10188756 Publication Date 1/29/2019 
Target
Name:
Histone deacetylase 2
Synonyms:
Cereblon/Histone deacetylase 2 HDAC2 Histone deacetylase 2 (HDAC2) | Human HDAC2
Type:
Chromatin regulator; hydrolase; repressor
Mol. Mass.:
55356.54
Organism:
Homo sapiens (Human)
Description:
Q92769
Residue:
488
  
Inhibitor
Name:
BDBM50353238
Synonyms:
CHEMBL1830399 | US10188756, Compound CN101
Type:
Small organic molecule
Emp. Form.:
C18H26N4O2
Mol. Mass.:
330.4246
SMILES:
CCCCc1nc2cc(\C=C\C(=O)NO)ccc2n1CCN(C)C
: