Target
Histone deacetylase 1
Ligand
BDBM323706
Substrate
Meas. Tech.
HDAC Inhibition Assay
IC50
1.20±n/a nM
Citation
 Hooker, JMWang, CSchroeder, FA Imaging histone deacetylases with a radiotracer using positron emission tomography US Patent  US10188756 Publication Date 1/29/2019 
Target
Name:
Histone deacetylase 1
Synonyms:
Cereblon/Histone deacetylase 1 HDAC1 Histone deacetylase 1 (HDAC1) RPD3L1
Type:
Enzyme
Mol. Mass.:
55090.27
Organism:
Homo sapiens (Human)
Description:
Q13547
Residue:
482
  
Inhibitor
Name:
BDBM323706
Synonyms:
US10188756, Compound CN112
Type:
Small organic molecule
Emp. Form.:
C20H22N2O4S
Mol. Mass.:
386.465
SMILES:
COc1ccc2Sc3ccccc3N(CCCCCC(=O)NO)C(=O)c2c1
: