Target
Histone deacetylase 5
Ligand
BDBM323707
Substrate
Meas. Tech.
HDAC Inhibition Assay
IC50
3850±n/a nM
Citation
 Hooker, JMWang, CSchroeder, FA Imaging histone deacetylases with a radiotracer using positron emission tomography US Patent  US10188756 Publication Date 1/29/2019 
Target
Name:
Histone deacetylase 5
Synonyms:
Antigen NY-CO-9 HDAC5 Histone acetylase 5 (HDAC5) Human HDAC5 | KIAA0600
Type:
Enzyme
Mol. Mass.:
121968.61
Organism:
Homo sapiens (Human)
Description:
Q9UQL6
Residue:
1122
  
Inhibitor
Name:
BDBM323707
Synonyms:
US10188756, Compound CN113
Type:
Small organic molecule
Emp. Form.:
C20H22N2O6S
Mol. Mass.:
418.463
SMILES:
COc1ccc2c(c1)C(=O)N(CCCCCC(=O)NO)c1ccccc1S2(=O)=O
: