Target
Histone deacetylase 8
Ligand
BDBM323707
Substrate
Meas. Tech.
HDAC Inhibition Assay
IC50
2840±n/a nM
Citation
 Hooker, JMWang, CSchroeder, FA Imaging histone deacetylases with a radiotracer using positron emission tomography US Patent  US10188756 Publication Date 1/29/2019 
Target
Name:
Histone deacetylase 8
Synonyms:
HD8 HDAC8_HUMAN Histone deacetylase 8 (HDAC-8) | Human HDAC8
Type:
Enzyme
Mol. Mass.:
41749.60
Organism:
Homo sapiens (Human)
Description:
Q9BY41
Residue:
377
  
Inhibitor
Name:
BDBM323707
Synonyms:
US10188756, Compound CN113
Type:
Small organic molecule
Emp. Form.:
C20H22N2O6S
Mol. Mass.:
418.463
SMILES:
COc1ccc2c(c1)C(=O)N(CCCCCC(=O)NO)c1ccccc1S2(=O)=O
: