Target
Histone deacetylase 6
Ligand
BDBM323708
Substrate
Meas. Tech.
HDAC Inhibition Assay
IC50
1.70±n/a nM
Citation
 Hooker, JMWang, CSchroeder, FA Imaging histone deacetylases with a radiotracer using positron emission tomography US Patent  US10188756 Publication Date 1/29/2019 
Target
Name:
Histone deacetylase 6
Synonyms:
Cereblon/Histone deacetylase 6 HDAC6 Histone deacetylase 6 (HDAC6) KIAA0901 | ORF Names:JM21
Type:
Chromatin regulator; hydrolase; repressor
Mol. Mass.:
131381.51
Organism:
Homo sapiens (Human)
Description:
Q9UBN7
Residue:
1215
  
Inhibitor
Name:
BDBM323708
Synonyms:
US10188756, Compound CN132
Type:
Small organic molecule
Emp. Form.:
C21H28N2O2
Mol. Mass.:
340.4592
SMILES:
ONC(=O)\C=C\c1ccc(CNCC23CC4CC(CC(C4)C2)C3)cc1
: