Target
Histone deacetylase 3
Ligand
BDBM323716
Substrate
Meas. Tech.
HDAC Inhibition Assay
IC50
470±n/a nM
Citation
 Hooker, JMWang, CSchroeder, FA Imaging histone deacetylases with a radiotracer using positron emission tomography US Patent  US10188756 Publication Date 1/29/2019 
Target
Name:
Histone deacetylase 3
Synonyms:
HD3 HDAC3_HUMAN Human HDAC3 SMAP45
Type:
Enzyme
Mol. Mass.:
48829.55
Organism:
Homo sapiens (Human)
Description:
O15379
Residue:
428
  
Inhibitor
Name:
BDBM323716
Synonyms:
US10188756, Compound CN146
Type:
Small organic molecule
Emp. Form.:
C23H31FN2O2
Mol. Mass.:
386.5028
SMILES:
ONC(=O)\C=C\c1ccc(CN(CCF)CC23CC4CC(CC(C4)C2)C3)cc1
: