Target
Histone deacetylase 6
Ligand
BDBM323720
Substrate
Meas. Tech.
HDAC Inhibition Assay
IC50
11.7±n/a nM
Citation
 Hooker, JMWang, CSchroeder, FA Imaging histone deacetylases with a radiotracer using positron emission tomography US Patent  US10188756 Publication Date 1/29/2019 
Target
Name:
Histone deacetylase 6
Synonyms:
Cereblon/Histone deacetylase 6 HDAC6 Histone deacetylase 6 (HDAC6) KIAA0901 | ORF Names:JM21
Type:
Chromatin regulator; hydrolase; repressor
Mol. Mass.:
131381.51
Organism:
Homo sapiens (Human)
Description:
Q9UBN7
Residue:
1215
  
Inhibitor
Name:
BDBM323720
Synonyms:
US10188756, Compound CN166
Type:
Small organic molecule
Emp. Form.:
C17H23FN2O2
Mol. Mass.:
306.3751
SMILES:
ONC(=O)\C=C\c1ccc(CNCC2CCCCC2)c(F)c1
: