Target
Sodium-dependent noradrenaline transporter
Ligand
BDBM323683
Substrate
Meas. Tech.
Norepinephrine, Transporter NET (h)
Ki
69.0±n/a nM
Citation
 Li, PZhao, JWennogle, LP Organic compounds US Patent  US10188758 Publication Date 1/29/2019 
Target
Name:
Sodium-dependent noradrenaline transporter
Synonyms:
Monoamine transporter NET Noradrenaline Transporter (NET) Norepinephrine transporter protein (NET) SLC6A2 Sodium-dependent noradrenaline transporter (NET) | Solute carrier family 6 member 2
Type:
Multi-pass membrane protein
Mol. Mass.:
69337.72
Organism:
Homo sapiens (Human)
Description:
P23975
Residue:
617
  
Inhibitor
Name:
BDBM323683
Synonyms:
(R)-3-Phenyl-3-(2-ethoxypyridin-3-yloxy)propan-1-amine | US10188758, Example 2
Type:
Small organic molecule
Emp. Form.:
C16H20N2O2
Mol. Mass.:
272.3422
SMILES:
CCOc1ncccc1O[C@H](CCN)c1ccccc1
: