Target
Sodium-dependent noradrenaline transporter
Ligand
BDBM323699
Substrate
Meas. Tech.
Norepinephrine, Transporter NET (h)
Ki
4.20±n/a nM
Citation
 Li, PZhao, JWennogle, LP Organic compounds US Patent  US10188758 Publication Date 1/29/2019 
Target
Name:
Sodium-dependent noradrenaline transporter
Synonyms:
Monoamine transporter NET Noradrenaline Transporter (NET) Norepinephrine transporter protein (NET) SLC6A2 Sodium-dependent noradrenaline transporter (NET) | Solute carrier family 6 member 2
Type:
Multi-pass membrane protein
Mol. Mass.:
69337.72
Organism:
Homo sapiens (Human)
Description:
P23975
Residue:
617
  
Inhibitor
Name:
BDBM323699
Synonyms:
(R)-3-(2-Ethoxypyridin-3-yloxy)-N-methyl-3-phenylpropan-1-amine | US10188758, Example 3
Type:
Small organic molecule
Emp. Form.:
C17H22N2O2
Mol. Mass.:
286.3688
SMILES:
CCOc1ncccc1O[C@H](CCNC)c1ccccc1
: