Target
Prostaglandin F2-alpha receptor
Ligand
BDBM323742
Substrate
Meas. Tech.
In Vitro Test of Inhibition of Human FP Receptor Activity (B-1A)
IC50
290±n/a nM
Citation
 Beck, HThaler, TKast, RMeibom, DMeininghaus, MTerjung, CDelbeck, MLustig, KMuenster, UOlenik, B Substituted N,2-diarylquinoline-4-carboxamides and the use thereof as anti-inflammatory agents US Patent  US10189788 Publication Date 1/29/2019 
Target
Name:
Prostaglandin F2-alpha receptor
Synonyms:
PF2R_HUMAN PGF2 alpha receptor PTGFR Prostanoid FP receptor
Type:
Enzyme
Mol. Mass.:
40072.29
Organism:
Homo sapiens (Human)
Description:
P43088
Residue:
359
  
Inhibitor
Name:
BDBM323742
Synonyms:
4-{[(6-Bromo-3-methyl-2-phenylquinolin-4-yl)carbonyl]amino}-3-hydroxybenzoic acid | US10189788, Example 22
Type:
Small organic molecule
Emp. Form.:
C24H17BrN2O4
Mol. Mass.:
477.307
SMILES:
Cc1c(nc2ccc(Br)cc2c1C(=O)Nc1ccc(cc1O)C(O)=O)-c1ccccc1
: