Target
Prostaglandin F2-alpha receptor
Ligand
BDBM323754
Substrate
Meas. Tech.
In Vitro Test of Inhibition of Human FP Receptor Activity (B-1A)
IC50
93.0±n/a nM
Citation
 Beck, HThaler, TKast, RMeibom, DMeininghaus, MTerjung, CDelbeck, MLustig, KMuenster, UOlenik, B Substituted N,2-diarylquinoline-4-carboxamides and the use thereof as anti-inflammatory agents US Patent  US10189788 Publication Date 1/29/2019 
Target
Name:
Prostaglandin F2-alpha receptor
Synonyms:
PF2R_HUMAN PGF2 alpha receptor PTGFR Prostanoid FP receptor
Type:
Enzyme
Mol. Mass.:
40072.29
Organism:
Homo sapiens (Human)
Description:
P43088
Residue:
359
  
Inhibitor
Name:
BDBM323754
Synonyms:
3-Fluoro-4-({[3-methyl-2-phenyl-6-(trifluoromethyl)quinolin-4-yl]carbonyl}amino)benzoic acid | US10189788, Example 34
Type:
Small organic molecule
Emp. Form.:
C25H16F4N2O3
Mol. Mass.:
468.3998
SMILES:
Cc1c(nc2ccc(cc2c1C(=O)Nc1ccc(cc1F)C(O)=O)C(F)(F)F)-c1ccccc1
: